{"text_format":"1","workbook":"xlsx","n_sheets":11,"sheets":["InCA","Rail Cost","Marine Cost","Not Used","Maps","Routes","Model","Data","Trial Hub","Truck Cost","BNSF"],"not_rendered":{"charts":20,"images":26,"macros":1,"external_links":0,"defined_names":134,"comments":4,"pivot_tables":0},"unopened":[],"bounds":{"document_bytes":16777216,"sheet_cells":100000,"rows_first":2000,"rows_last":500,"rows_between":2000,"halvings":0,"cell_chars":16384,"cell_head_chars":4096},"cells_cut":0,"cells_raw":0,"read":"whole","date_system":"1900"}

{"sheet":"InCA","index":0,"n_rows":14,"n_cols":18,"rows_kept":14,"cut":false,"hidden":true,"merged":[]}
[null,"Welcome to InCA - the Intermodal Corridor Analyzer",null,null,null,null,null,null,null,"Model: ","Updated April 23, 2009",null,null,null,"Version: ",0.49,null,"Center for Transportion Research"]
[]
[]
[]
[]
[]
[]
[null,null,null,null,null,null,null,null,null,null,null,null,null,null,null,"miles ="]
[]
[null,null,null,null,null,null,null,null,null,"Miles ="]
{"$rows_left_out":5}
{"sheet":"Rail Cost","index":1,"n_rows":148,"n_cols":39,"rows_kept":148,"cut":false,"hidden":true,"merged":[[20,21,20,24],[38,5,38,7],[49,26,49,29]]}
[null,"RAIL LINE HAUL COST ANALYSIS",null,null,null,null,null,null,null,null,"Model: Updated June 08, 2009","Version: ",0.8]
[]
[null,null,{"$f":"P16","v":" "}]
[null,"cell legend:","user input","calculation",null,"cost calculation",null,"optional inputs",null,null,"note: Calculation cells have been locked. To edit cells, go to \"Review\" tab, and click \"unprotect sheet\".",null,null,null,null,null,null,null,null,"Default Unit: tons"]
[]
[null,null,null,null,null,"new to rail technology?",null,null,null,null,null,null,null,null,null,null,null,null,null,null,null,null,null,null,null,null,null,null,null,null,null,null,null,null,null,null,null,null,"http://www.uprr.com/customers/equip-resources/cartypes/intermodal.shtml"]
[]
[null,null,null,null,null,"total cost",null,{"$f":"H25","v":36671.312683463424}]
[]
[]
{"$rows_left_out":139}
{"sheet":"Marine Cost","index":2,"n_rows":97,"n_cols":57,"rows_kept":97,"cut":false,"hidden":true,"merged":[[6,32,7,32],[62,42,63,42],[62,43,63,43],[62,50,63,50],[6,21,7,21],[6,22,7,22],[6,23,7,23],[6,24,7,24],[6,25,7,25],[6,26,7,26],[59,42,59,50],[60,42,60,50],[61,42,61,43],[61,44,61,50],[66,47,67,47],[66,48,67,48],[66,49,67,49],[66,50,67,50],[64,42,65,42],[64,43,65,43],[64,44,65,44],[64,45,65,45],[64,46,65,46],[64,47,65,47],[64,48,65,48],[64,49,65,49],[64,50,65,50],[66,42,67,42],[66,43,67,43],[66,44,67,44],[66,45,67,45],[66,46,67,46],[70,49,71,49],[70,50,71,50],[72,42,73,42],[72,43,73,43],[72,44,73,44],[72,45,73,45],[72,46,73,46],[72,47,73,47],[72,48,73,48],[70,42,71,42],[70,43,71,43],[70,44,71,44],[70,45,71,45],[70,46,71,46],[70,47,71,47],[72,49,73,49],[72,50,73,50],[70,48,71,48],[68,42,69,42],[68,43,69,43],[68,44,69,44],[68,45,69,45],[68,46,69,46],[68,47,69,47],[68,48,69,48],[68,49,69,49],[68,50,69,50],[76,47,77,47],[76,48,77,48],[76,49,77,49],[76,50,77,50],[74,42,75,42],[74,43,75,43],[74,44,75,44],[74,45,75,45],[74,46,75,46],[74,47,75,47],[74,48,75,48],[74,49,75,49],[74,50,75,50],[76,42,77,42],[76,43,77,43],[76,44,77,44],[76,45,77,45],[76,46,77,46],[78,50,79,50],[80,42,81,42],[80,43,81,43],[80,44,81,44],[80,45,81,45],[80,46,81,46],[80,47,81,47],[80,48,81,48],[78,42,79,42],[78,43,79,43],[78,44,79,44],[78,45,79,45],[78,46,79,46],[78,47,79,47],[1,0,1,16383],[3,0,3,16383],[4,0,4,3],[4,8,4,11],[5,24,5,26],[82,50,83,50],[84,42,85,42],[84,48,85,48],[84,49,85,49],[84,50,85,50],[80,49,81,49],[80,50,81,50],[84,43,85,43],[84,44,85,44],[84,45,85,45],[84,46,85,46],[84,47,85,47],[82,47,83,47],[82,48,83,48],[82,49,83,49],[78,48,79,48],[78,49,79,49],[82,44,83,44],[82,45,83,45],[88,49,89,49],[88,50,89,50],[86,48,87,48],[86,49,87,49],[86,50,87,50],[71,8,71,10],[116,0,117,12],[2,7,2,12],[88,47,89,47],[88,48,89,48],[86,42,87,42],[86,43,87,43],[86,44,87,44],[86,45,87,45],[86,46,87,46],[86,47,87,47],[88,42,89,42],[88,43,89,43],[88,44,89,44],[88,45,89,45],[88,46,89,46],[82,42,83,42],[82,43,83,43],[82,46,83,46]]}
[null,"    SHIPPING LINE HAUL COST ANALYSIS",null,null,"Credit  to: Jim Kruse, TTI",null,null,null,null,"Model: Updated May 05, 2009","Version: ",0.6]
[]
[null,"Cell Legend >>","User Input","Calculation"," Total Cost"]
[]
["Cargo Weight and Ship Data",null,null,null,null,null,null,null,"Basic Trip Details ",null,null,null,null,null,null,null,null,null,null,"Data Table",null,"Container shipping tables"]
[null,null,"Input/Output",null,null,null,null,null,null,null,"Input/Output",null,null,null,null,null,null,null,null,"Yes",null,null,null,null,"Million USD"]
[null,"cargo weight of one (1) container (FEU)",30,"tons",null,null,null,null,null,"port of loading","Long Beach","port",null,null,null,null,null,null,null,"No",null,"TEU Capacity","Service Speed","Fuel Consumption","DNV Newbuild","Alphaliner Newbuild","Average Newbuild",null,null,null,null,"Daily Rep & Maint","Daily Others",null,null,null,null,"Northbound",null,null,null,null,null,null,null,"CONTAINER-RELATED PORT CHARGES",null,null,null,null,null,null,null,null,null,null,"Port Distance Matrix"]
[null,null,null,null,null,null,null,null,null,"port of discharging","Houston-BC","port",null,null,null,null,null,null,null,null,null,null,null,null,null,null,null,"Daily","No. of","Daily","Daily","Daily Rep",null,null,"Panama3","Suez Canal","Estimated","Suez",null,null,null,"LOADED",null,null,null,null,null,null,null,null,null,null,null,"Port Charges"]
[null,"tare weight of one (1) container (40 feet)",4,"tons",null,null,null,null,null,"distance (nautical miles)",4454,"nautical miles",null,null,null,null,null,null,null,null,null,null,"(knots)","(tonnes/day)","price","price","price","Manning","Crew","H&M Ins","P&I","price","price","DWT","Canal Chg","Net Tonn.","GRT2","Dues1",null,null,null,null,"Port","Total","% of",null,null,null,null,null,"Clean ","Stevedore",null,"http://www.portofhouston.com/pdf/maritime/2009_Tariff14&15_Rates.pdf"]
[null,null,null,null,null,null,null,null,null,"trip time",{"$f":"(K9/K19)/24","v":10.484934086629002},"days",null,null,null,null,null,null,null,null,null,600,16.399999999999999,18.899999999999999,19,18.8,{"$f":"(Z10+Y10)/2","v":18.899999999999999},3167,16,398,274,870,1300,9000,43468,10000,{"$f":"(0.458636*AH10)+849.572834","v":4977.2968339999998},100891,null,null,null,null,null,"TEUs","TEUs","Wharfage","Security","Throughput","Gate Fee","Infra Fee","Truck","Fee"]
{"$rows_left_out":88}
{"sheet":"Not Used","index":3,"n_rows":132,"n_cols":27,"rows_kept":132,"cut":false,"hidden":true,"merged":[[132,14,132,20],[0,14,0,20],[1,14,1,20],[3,14,3,16],[3,17,3,19],[3,20,4,20],[2,14,2,20]]}
[null,null,null,"Service Level","Equipment","Goal Hrs 0","Goal Hrs 1","Goal Hrs 2","Goal Hrs 3","Goal Hrs 4","Goal Hrs 5","Goal Hrs 6",null,null,"BNSF 6003 Rail Miles Inquiry",null,null,null,null,null,null,null,null,"Union Pacific"]
[null,"Alliance, TX  - Chicago, IL",null,"Expedited","Container",37,37,37,38,38,40,null,null,null,"Search Date - May 14 , 2009 | Effective Date - May 14 , 2009",null,null,null,null,null,null,null,null,"Origin, St","Destination, St","Service Level","Hrs"]
[null,"Alliance, TX - Global Gateway So, CA",null,"Expedited","Trailer",35,35,35,36,36,38,null,null,null,null,null,null,null,null,null,null,null,null,"Dallas (DIT, TX)","Los Angeles (ICTF, CA)","Standard",85]
[null,"Alliance, TX - Kansas City, KS",null,"Premium","Container",58,58,58,58,58,58,null,null,null,"Origin",null,null,"Destination",null,null,"Rail Miles",null,null,"Dallas (DIT, TX)","Northern California (Oakland, CA)","Standard",157]
[null,"Alliance, TX - La Harbor Apm Termi, CA",null,"Premium","Container",null,null,null,96,null,null,null,"Restricted*",null,"City","State","SPLC","City","State","SPLC",null,null,null,"Dallas (Mesquite, TX)","Chicago (Yard Center, IL)","Standard",47]
[null,"Alliance, TX - Long Beach A Pier, CA",null,"Expedited","Trailer",null,28,28,28,31,31,31,null,null,"ALLIANCE","TX",668100,"CHICAGO","IL",380000,963,null,null,"Dallas (Mesquite, TX)","Los Angeles (Los Angeles, CA)","Standard",66]
[null,"Alliance, TX - Long Beach Its, CA",null,"Premium","Container",null,30,30,30,30,30,30,null,null,"ALLIANCE","TX",668100,"CHICAGO","IL",380000,963,null,null,"Dallas (Mesquite, TX)","Los Angeles (Los Angeles, CA)","Expedited",62]
[null,"Alliance, TX - Long Beach J Pier, CA",null,"Premium","Container",null,96,null,null,96,null,null,"Restricted*",null,"ALLIANCE","TX",668100,"CHICAGO","IL",380000,963,null,null,"Dallas (Mesquite, TX)","Los Angeles (Los Angeles, CA)","SuperFlyer",57]
[null,"Alliance, TX - Long Beach Lbc, CA",null,"Premium","Container",null,null,null,null,null,96,null,"Restricted*",null,"ALLIANCE","TX",668100,"GLOBAL GATEWAY SO","CA",883735,1521,null,null,"Dallas (Mesquite, TX)","Memphis (Marion, AR)","Standard",64]
[null,"Alliance, TX - Long Beach Pct, CA",null,"Premium","Container",null,null,null,null,null,96,null,"Restricted*",null,"ALLIANCE","TX",668100,"KANSAS CITY","KS",581520,529,null,null,"Dallas (Mesquite, TX)","Portland (Albina, OR)","Standard",138]
{"$rows_left_out":123}
{"sheet":"Maps","index":4,"n_rows":142,"n_cols":21,"rows_kept":142,"cut":false,"hidden":true,"merged":[[123,16,123,17]]}
[]
[]
[null,null,null,null,null,null,null,null,"BNSF Terminals",null,null,null,null,null,null,null,null,null,null,null,"UP Terminals"]
[null,null,null,null,null,null,null,null,"Alliance, TX",null,null,null,null,null,null,null,null,null,null,null,"Barbours Cut, TX"]
[null,null,null,null,null,null,null,null,"Amarillo, TX",null,null,null,null,null,null,null,null,null,null,null,"Dallas (DIT, TX)"]
[null,null,null,null,null,null,null,null,"Atlanta, GA",null,null,null,null,null,null,null,null,null,null,null,"Dallas (Mesquite, TX)"]
[null,null,null,null,null,null,null,null,"Barbours Cut, TX",null,null,null,null,null,null,null,null,null,null,null,"El Paso (Alfalfa, TX)"]
[null,null,null,null,null,null,null,null,"Birmingham, AL",null,null,null,null,null,null,null,null,null,null,null,"Englewood (Houston, TX)"]
[null,null,null,null,null,null,null,null,"Chicago, IL",null,null,null,null,null,null,null,null,null,null,null,"Laredo (Port Laredo, TX)"]
[null,null,null,null,null,null,null,null,"El Paso, TX",null,null,null,null,null,null,null,null,null,null,null,"Long Beach (ICTF, CA)"]
{"$rows_left_out":133}
{"sheet":"Routes","index":5,"n_rows":82,"n_cols":25,"rows_kept":82,"cut":false,"hidden":true,"merged":[[2,1,2,14],[30,1,30,15],[64,2,64,16]]}
[]
[]
[null,"Union Pacific",null,null,null,null,null,null,null,null,null,null,null,null,null,null,null,"Resources"]
[null,null,"Barbours Cut, TX","Dallas (DIT, TX)","Dallas (Mesquite, TX)","El Paso (Alfalfa, TX)","Englewood (Houston, TX)","Laredo (Port Laredo, TX)","Long Beach (ICTF, CA)","Los Angeles (City Of Industry, CA) ","Los Angeles (LA, CA)","Northern California (Oakland, CA)","San Antonio (SAIT, TX)","Houston (Settegast, TX)",null,null,null,"http://www.bnsf.com/markets/intermodal/pdf/small_Intermodal_map_2009.pdf"]
[null,"Barbours Cut, TX",0,290,301,833,26,384,1671,1641,1656,2086,229,24,null,null,null,"http://www.uprr.com/customers/intermodal/intmap/index.shtml"]
[null,"Dallas (DIT, TX)",290,0,15,642,266,442,1466,1450,1466,1896,290,265,null,null,null,"http://c02.my.uprr.com/cdm/intermodal/intermodal_schedule.jas?industryaffiliation=intermodal&cmd"]
[null,"Dallas (Mesquite, TX)",{"$f":"E5","v":301},{"$f":"E6","v":15},0,657,278,453,1496,1465,1481,1911,301,277,null,null,null,"http://www.bnsf.com/markets/intermodal/pdf/Intermodal_map_large_2009.pdf"]
[null,"El Paso (Alfalfa, TX)",{"$f":"$F5","v":833},{"$f":"F6","v":642},{"$f":"F7","v":657},0,812,741,1481,808,824,1254,604,810,null,null,null,"http://www.kcsouthern.com/en-us/KCS/Documents/system_map%5B1%5D.pdf"]
[null,"Englewood (Houston, TX)",{"$f":"G5","v":26},{"$f":"G6","v":266},{"$f":"G7","v":278},{"$f":"G8","v":812},0,352,1651,1620,1636,2066,204,4,null,null,null,"http://www.kcsouthern.com/en-us/Customers/Pages/Intermodal.aspx"]
[null,"Laredo (Port Laredo, TX)",{"$f":"H5","v":384},{"$f":"H6","v":442},{"$f":"H7","v":453},{"$f":"H8","v":741},{"$f":"H9","v":352},0,1568,1549,1565,1995,155,361,null,null,null,"http://www.bnsf.com/tools/glossary.html"]
{"$rows_left_out":73}
{"sheet":"Model","index":6,"n_rows":77,"n_cols":27,"rows_kept":77,"cut":false,"hidden":false,"merged":[[65,6,65,9],[51,6,51,9],[40,11,40,14],[20,21,20,24],[38,16,38,19],[38,6,38,9],[21,16,21,19],[37,21,37,24],[7,7,7,8],[48,21,48,24],[0,2,0,3],[0,7,0,8],[0,17,0,18],[0,22,0,23],[2,1,2,4],[2,6,2,9],[0,12,0,13],[2,16,2,19],[2,21,2,24],[2,11,2,14]]}
[null,null,"STEP 1",null,null,null,null,{"$f":"IF(OR(ROUND(equation_of_motion,2)<>0,ROUND(equation_maxspeed_upperbound,2)<>0),\"RECALCULATE SPEED NOW\",\"STEP 2\")","v":"STEP 2"},null,null,null,null,{"$f":"IF(OR(ROUND(equation_of_motion,2)<>0,ROUND(equation_maxspeed_upperbound,2)<>0),\"RECALCULATE SPEED NOW\",\"STEP 2\")","v":"STEP 2"},null,null,null,null,"STEP 4",null,null,null,null,"STEP 5"]
[]
[null,"Cargo Weight, Number of Containers, and Rail Car Configuration Module",null,null,null,null,"Configure Locomotives Module",null,null,null,null,"Basic Trip Details Module",null,null,null,null,"Fuel Consumption & Cost Module ($$$)",null,null,null,null,"Maintenance Cost Module ($$$)"]
[null,"required [x]",null,"Input/Output",null,null,"type-1 loco",null,"Input/Output",null,null,"required [x]",null,"Input/Output",null,null,null,null,"Input/Output",null,null,null,null,"Input/Output"]
[null,"x","select type of container (20ft., 40ft., 45ft. HC)","40 ft Dry","type",null,null,"select locomotive horsepower ",4000,"hp",null,"x","select railroad company","BNSF",null,null,"x","price per gallon of fuel (p)",2.5,"$ USD",null,null,"track maintenance",0.5,"$ per car, per loco. mile"]
[null,null,{"$f":"\"tare weight of one \" & D5","v":"tare weight of one 40 ft Dry"},{"$f":"VLOOKUP(D5,Data!D4:E9,2)","v":4.2},"tons",null,null,"average length of a locomotive",{"$f":"VLOOKUP(I5,Data!I19:L26,3)","v":75},"ft.",null,{"$f":"IF($N$5=\"CTR RailRoad\",\"  \",\"x\")","v":"x"},{"$f":"IF($N$5=\"CTR RailRoad\",\"[inputs disabled]\",\"select origin\")","v":"select origin"},"ALLIANCE",null,null,"x","thermal efficiency of diesel-electric engine (decimal)(η)",0.35,"(25-30%)",null,null,"car maintenance",0.12,"$/mile"]
[null,null,null,null,null,null,null,"number of axles",6,"axles",null,{"$f":"IF($N$5=\"CTR RailRoad\",\"  \",\"x\")","v":"x"},{"$f":"IF($N$5=\"CTR RailRoad\",\"\",\"select destination\")","v":"select destination"},"CHICAGO",null,null,null,"total horsepower of locomotives ",{"$f":"I13","v":11545.454545452925},"hp",null,null,"locomotive maintenance",2.1,"$/mile"]
[null,"x",{"$f":"IF(input_container_type=Data!D8,\"input cargo weight per car\", \"input cargo weight per container\")","v":"input cargo weight per container"},15,"tons",null,null,{"$f":"IF(input_hptt_ratio>6,\"WARNING!! MAX HPTT = 6.0\", \" \")","v":" "}]
[null,null,{"$f":"IF(input_container_type=Data!D8,\"cargo weight of one car\", \"gross weight of one container\")","v":"gross weight of one container"},{"$f":"D8+D6","v":19.2},"tons",null,null,"input desired maximum train speed",80,"mph",null,null,{"$f":"IF($N$5=\"CTR RailRoad\",\"go to 'user rail inputs', and select 'Yes'\",\"default distance\")","v":"default distance"},{"$f":"IF($N$5=\"CTR Railroad\",\" \",VLOOKUP($N$5,Data!D18:F21,2))","v":963},{"$f":"IF($N$5=\"CTR RailRoad\",\"  \",\"miles\")","v":"miles"},null,null,"fuel surcharge (optional)",0,"$/mile",null,null,"Total maintenance",{"$f":"(X5*(D23+I28)+(X6*D23)+(X7*I28))*N32","v":10670},"$$$"]
[null,null,null,{"$f":"IF(Model!D16>VLOOKUP(input_car_type,Data!I4:P13,3),\"Max. Allowable Weight  of \" & VLOOKUP(input_car_type,Data!I4:P13,3)& \" tons Exceeded\",\" \")","v":" "},null,null,null,"input desired horsepower per ton ratio",4.1233766233760445,"hptt",null,null,"percentage grade of terrain",0,"%",null,null,"total fuel surcharge",{"$f":"S9*N32","v":0},"$$$",null,null,"track only maintenance cost per gross ton-mile",{"$f":"X9/(I42*N32)","v":1.1411764705882352E-2},"$/ton-mile"]
{"$rows_left_out":68}
{"sheet":"Data","index":7,"n_rows":45,"n_cols":23,"rows_kept":45,"cut":false,"hidden":false,"merged":[[24,3,24,6],[33,3,33,6],[15,17,15,22],[1,17,1,18],[1,8,1,15],[15,3,15,5],[1,3,1,6],[16,8,16,12]]}
[]
[null,"Select ",null,"Containers",null,null,null,null,"Rail Cars (Single unit data)  Source: http://www.tealinc.com/carposting.htm",null,null,null,null,null,null,null,null,"Kadj values"]
[null,"Yes",null,"container","tare wt.","TEUs","max. payload (tons)",null,"type","tare weight (tons)","max gross wt.","length","cost","axles","K values","Kadj values",null,"equipment","Kadj"]
[null,"No",null,"20 ft. Dry",2.5,1,24,null,"Auto Transporters",74,130,145.33000000000001,null,4,7.0000000000000007E-2,1.3,null,"Pre-1950 equipment",1]
[null,null,null,"20 ft. Reefer",3.2,1,24,null,"Boxcars",37.1,143,58.35,null,4,7.0000000000000007E-2,0.85,null,"Conventional post-1950 cars",0.85]
[null,{"$f":"IF(input_containers=Data!I7,$B$3:$B$4,\"inactive\")","v":"inactive"},null,"40 ft Dry",4.2,2,30,null,"Center Partition Railcars",30.5,143,80.53,null,4,7.0000000000000007E-2,0.85,null,"Container-on-flatcar",0.95]
[null,null,null,"45 ft. H. Cube",4.5,2,30,null,"Container Carriers (5-unit)",17.600000000000001,110,53,{"$f":"195000/5","v":39000},4,9.35E-2,0.95,null,"Trailer-on-flatcar and hopper cars",1.05]
[null,null,null,"No Containers",0,0,30,null,"Gondolas",37.5,143,66,null,4,7.0000000000000007E-2,0.85,null,"Empty, covered auto racks",1.2]
[null,null,null,"Reefer 40 ft.",4.8,2,30.5,null,"High Cube Box Cars",39.65,143,67.875,null,4,7.0000000000000007E-2,0.85,null,"Loaded auto racks",1.3]
[null,null,null,null,null,null,null,null,"Hoppers",30.75,143,58,null,4,7.0000000000000007E-2,1.05,null,"Empty, uncovered auto racks",1.9]
{"$rows_left_out":36}
{"sheet":"Trial Hub","index":8,"n_rows":105,"n_cols":29,"rows_kept":105,"cut":false,"hidden":false,"merged":[[2,28,2,31],[2,14,2,17],[27,17,30,18],[0,0,3,0],[8,21,8,22],[0,19,0,21],[25,7,25,18],[0,3,0,4],[2,1,2,12]]}
[null,"User Input Column",null,"MACROS MUST BE ENABLED",null,null,null,null,null,null,null,null,null,null,null,null,null,null,null,"SYSTEM REQUIREMENTS: EXCEL 2007 AND ABOVE WITH MACROS ENABLED."]
[]
[null,"Analysis Table",null,null,null,null,null,null,null,null,null,null,null,null,"Scenario Manager",null,null,null,null,null,null,null,null,null,null,null,null,null,"Don’t Delete"]
[null,"Input Data Column","total cost","per ton-mile","per mile","per  TEU","per  FEU/Carload","%fuel","No. of Locos","Speed (mph)","Travel Time (hr)","Horsepower Rqd","% maintenance",null,null,"Build","Output",null,null,null,null,null,null,null,null,null,null,null,"Yes"]
[null,50,9150.4343000000008,3.4660736143183066,33.274299999999997,91.504300000000001,366.01740000000001,0.33768805190173812,2,80,3.4375,6876.8831168798706,0.62210161696871014,null,"Fuel Price ($)",2.5,{"$f":"input_fuel_price","v":2.5},{"$f":"IF(P5=Q5,\"GOOD\",\"ANALYZED\")","v":"GOOD"},null,null,null,null,null,null,null,null,null,null,"No"]
[null,60,10424.776099999999,3.2906490233658907,37.908299999999997,86.873099999999994,347.49250000000001,0.33665361104292607,2,80,3.4375,7810.5974025941559,0.62783122950894676,null,"Distance (miles)",275,{"$f":"user_input_distance","v":275},{"$f":"IF(P6=Q6,\"GOOD\",\"ANALYZED\")","v":"GOOD"}]
[null,70,12437.662399999999,3.36516839577757,45.227899999999998,88.840400000000002,355.36180000000002,0.31590218245386043,3,80,3.4375,8744.3116883084422,0.65225279036394368,null,"Max Speed (mph)",80,{"$f":"train_trip_speed","v":79.9999999999946},"ANALYZED"]
[null,80,13712.004199999999,3.2462131048811962,49.861800000000002,85.7,342.80009999999999,0.31714042806466575,3,80,3.4375,9678.0259740259735,0.65380668636386652,null,"No. of Sidings",0,{"$f":"user_input_sidings","v":0},"GOOD"]
[null,90,14986.3459,3.1536923230722915,54.495800000000003,83.257499999999993,333.0299,0.31816808890641346,3,80,3.4375,10611.740259737015,0.65509631586684891,null,"  Average Sidings Delay (min.)",0,{"$f":"user_input_sidings_delay","v":0},"GOOD"]
[null,100,16260.6877,3.0796756976254431,59.129800000000003,81.303399999999996,325.21379999999999,0.3190346752407246,3,80,3.4375,11545.454545451303,0.65618381016269967,null,"Type of Container","40 ft Dry",{"$f":"input_container_type","v":"40 ft Dry"},"GOOD"]
{"$rows_left_out":96}
{"sheet":"Truck Cost","index":9,"n_rows":93,"n_cols":28,"rows_kept":93,"cut":false,"hidden":false,"merged":[[86,8,86,10],[6,23,6,25],[68,1,68,6],[12,8,12,10],[24,8,24,10],[78,1,78,6],[22,0,22,2],[30,0,30,2],[77,8,77,10],[69,8,69,10],[55,8,55,10],[46,8,46,10],[22,4,22,6],[35,8,35,10],[4,22,4,25],[2,7,2,12],[3,0,3,16383],[4,0,4,3],[4,8,4,11]]}
[null,"SEMI-TRAILER LINE HAUL COST ANALYSIS",null,null,null,null,null,null,null,"Model: Updated April 16, 2009","Version: ",0.7]
[]
[null,"Cell Legend >>","User Input","Calculation"," Total Cost",null,null,"note: calculation cells have been locked. to freely edit cells, \"unprotect sheet\" (under \"review\" tab)."]
[]
["Cargo and Trailer Weight",null,null,null,null,null,null,null,"Basic Trip Details ",null,null,null,null,null,null,null,null,"Data Table",null,null,null,null,"Vehicle Configuration"]
[null,null,"Input/Output","(unit)",null,null,null,null,null,null,"Input/Output","(unit)",null,null,null,null,null,"Yes"]
[null,"cargo weight of one (1) container",15,"tons",null,null,null,null,null,"distance",275,"miles",null,null,null,null,null,"No",null,null,null,null,"type","Container Sizes",null,null,"Tare Weight","cost"]
[null,null,null,null,null,null,null,null,null,"average speed",65,"mph",null,null,null,null,null,null,null,null,null,null,"Standard Double",20,20,null,17.600000000000001]
[null,"tare weight of one (1) container (40 feet)",4,"tons",null,null,null,null,null,"estimated annual mileage",60000,"miles",null,null,null,null,null,null,null,null,null,null,"Standard Tractor-Semi",53,null,null,17.7]
[null,"tare weight of trailer",5,"tons",null,null,null,null,null,null,null,null,null,null,null,null,null,null,null,null,null,null,"6-Axle Tractor-Semi",53,null,null,18.850000000000001]
{"$rows_left_out":84}
{"sheet":"BNSF","index":10,"n_rows":374,"n_cols":12,"rows_kept":374,"cut":false,"hidden":true,"merged":[[2,8,2,11],[373,0,373,6],[374,0,374,6],[0,0,0,6],[1,0,1,6],[2,0,2,6],[3,0,3,2],[3,3,3,5],[3,6,4,6]]}
["BNSF 6003 Rail Miles Inquiry"]
["Search Date - Aug 24 , 2009 | Effective Date - Aug 24 , 2009"]
[null,null,null,null,null,null,null,null,"DO NOT TOUCH"]
["Origin",null,null,"Destination",null,null,"Rail Miles",null,null,null,null,"City/Terminals"]
["City","State","SPLC","City","State","SPLC",null,null,null,"Miles",null,"ALBUQUERQUE"]
["ALBUQUERQUE","NM",774900,"CHICAGO","IL",380000,1277,null,{"$f":"A6&D6","v":"ALBUQUERQUECHICAGO"},{"$f":"G6","v":1277},null,"ALLIANCE"]
[null,null,null,null,null,null,"OD Pair Unavailable",null,{"$f":"A7&D7","v":""},{"$f":"G7","v":"OD Pair Unavailable"},null,"AMARILLO"]
["ALLIANCE","TX",668100,"CHICAGO","IL",380000,963,null,"ALLIANCECHICAGO",963,null,"ATLANTA"]
["ALLIANCE","TX",668100,"GLOBAL GATEWAY SO","CA",883735,1521,null,"ALLIANCEGLOBAL GATEWAY SO",1521,null,"BARBOURS CUT"]
["ALLIANCE","TX",668100,"KANSAS CITY","KS",581520,529,null,"ALLIANCEKANSAS CITY",529,null,"BIRMINGHAM"]
{"$rows_left_out":364}